{"text_format":"1","workbook":"xlsx","n_sheets":11,"sheets":["gl. til nyt niveau","reguleringsprocenter","Lønark","Forside","Omregningstabel ","Tillæg_trin","Tillæg_kr","Omregner_gl. til nyt_niveau","Tid op_ned","Samlet_omk","Omregner_00_niveau"],"not_rendered":{"charts":0,"images":11,"macros":1,"external_links":0,"defined_names":83,"comments":0,"pivot_tables":0},"unopened":[],"bounds":{"document_bytes":16777216,"sheet_cells":100000,"rows_first":2000,"rows_last":500,"rows_between":2000,"halvings":0,"cell_chars":16384,"cell_head_chars":4096},"cells_cut":0,"cells_raw":0,"read":"whole","date_system":"1900"}

{"sheet":"gl. til nyt niveau","index":0,"n_rows":395,"n_cols":6,"rows_kept":395,"cut":false,"hidden":true,"merged":[]}
[null,1.3980790000000001]
[null,null,null,"Nyt grundbeløb","Nyt grundbeløb"]
["Grundbeløb pr. 1/10-1984","I alt pr. 1. april 1999 inkl. %regulering",null,"pr. 31/3-2000","pr. 31/3-2000"]
[null,null,null,"ekskl. afrunding","inkl. afrunding"]
[null,null,null,null,null,"beløb"]
[null,"pr. gang/år","pr. måned",null,null,"+/-"]
[1.63,{"$f":"IF(A7<1000,$B$1*A7,ROUND($B$1*A7,0))","v":2.2788687699999999},null,{"$f":"B7","v":2.2788687699999999},{"$f":"IF(D7<1000,D7,ROUND(D7,-2))","v":2.2788687699999999}]
[5,6.9903950000000004,null,{"$f":"B8","v":6.9903950000000004},6.9903950000000004]
[5.8,8.1088582000000002,null,8.1088582000000002,8.1088582000000002]
[9,12.582711,null,12.582711,12.582711]
[10.5,14.6798295,null,14.6798295,14.6798295]
[12.22,17.084525380000002,null,17.084525380000002,17.084525380000002]
[12.65,17.68569935,null,17.68569935,17.68569935]
[13.39,18.720277810000002,null,18.720277810000002,18.720277810000002]
[13.75,19.22358625,null,19.22358625,19.22358625]
{"$rows_left_out":381}
{"sheet":"reguleringsprocenter","index":1,"n_rows":28,"n_cols":4,"rows_kept":28,"cut":false,"hidden":true,"merged":[]}
[]
[null,"Reguleringsprocenter",null,"pensionsudbygning"]
[null,"Valgt:",{"$f":"VLOOKUP(Forside!K11,reguleringsprocenter!B4:D15,2,TRUE)","v":1.083866}]
[null,"2019-04-01",1.020238,1]
[null,"2019-10-01",1.0280750000000001,1]
[null,"2020-01-01",1.045075,1]
[null,"2020-04-01",1.049075,1]
[null,"2020-10-01",1.0532239999999999,1]
[null,"2021-04-01",1.061123,1]
[null,"2021-10-01",1.0644739999999999,1]
[null,"2022-04-01",1.0644739999999999,1]
[null,"2022-10-01",1.083866,1]
[null,"2023-01-01",1.0919760000000001,1]
[]
[]
{"$rows_left_out":14}
{"sheet":"Lønark","index":2,"n_rows":70,"n_cols":120,"rows_kept":70,"cut":false,"hidden":true,"merged":[]}
["Næstved",null,null,null,null,null,null,null,null,null,null,null,null,null,null,null,null,null,null,null,null,null,null,"Løn","Årsløn",null,null,"Ureguleret ikke-pensionsgivende tillæg",null,null,null,"Årsløn ialt "]
[null,null,null,null,null,null,null,null,null,null,null,null,null,null,null,null,null,null,null,null,null,null,null,"trin","Grundsats","%-reg.","Sats","Omr 1","Omr 2","Omr 3","Omr 4",null,null,null,null,null,null,"Områdetillæg inkl. regulering",null,null,null,null,"Årsløn i alt ",null,null,null,null,null,"Pensionsgivende årsløn i alt ",null,null,null,null,"Pensionsgivende løn",null,null,null,null,null,null,null,null,"Pensionsgivende løn",null,null,null,null,null,"Løn","timelønninger",null,null,null,null,null,"Løn","timelønninger + 50%",null,null,null,null,null,"Løn","søndagstillæg - 50%",null,null,null,null,null,null,null,null,null,null,null,null,null,null,null,null,null,null,null,null,null,1.3441050000000001]
[null,"Månedsløn, løngrupper",null,null,"Lønniveau:",{"$f":"VLOOKUP(beregningsdato,regpct_tabel,1,TRUE)","v":"2022-10-01"},null,"Optrapning fra:",null,null,null,null,"Pensionsgivende løn",null,null,null,null,null,"Pensionsgivende løn, optrapning fra:",null,null,null,null,null,null,null,null,null,null,null,null,null,null,null,null,null,null,1,2,3,4,null,"Omr 0","Omr 1","Omr 2","Omr 3","Omr 4",null,"Omr 0","Omr 1","Omr 2","Omr 3","Omr 4","Grundsats","%-reg.","Sats",null,"Pensionsudbygningspct:",null,null,{"$f":"VLOOKUP(F3,regpct_tabel,3,FALSE)","v":1},null,"Omr 0","Omr 1","Omr 2","Omr 3","Omr 4",null,"trin","Omr 0","Omr 1","Omr 2","Omr 3","Omr 4",null,"trin","Omr 0","Omr 1","Omr 2","Omr 3","Omr 4",null,"trin","Omr 0","Omr 1","Omr 2","Omr 3","Omr 4",null,null,null,null,null,null,null,null,null,null,null,null,null,null,"niveau","kolonne",null,"2017-10-01",null,null,null,"2018-10-01"]
[null,0,1,2,3,4,null,"0->1","1->2","2->3",null,null,0,1,2,3,4,null,"0->1","1->2","2->3","3->4",null,null,{"$f":"VLOOKUP(beregningsdato,Lønprojekt_DR,2,TRUE)","v":1339},{"$f":"valgt_regulering-1","v":8.3865999999999996E-2},"2019-04-01","2022-04-01",{"$f":"VLOOKUP(beregningsdato,Lønprojekt_DR,3,TRUE)","v":620},4,5,null,null,null,null,null,null,{"$f":"IF(beregningsdato<40087,0,regulering)","v":8.3865999999999996E-2},{"$f":"IF(beregningsdato<40087,0,5)","v":5},null,null,null,null,null,null,null,null,null,null,null,null,null,null,null,null,null,null,null,null,null,null,null,null,null,null,null,null,null,null,null,null,null,null,null,null,null,null,null,null,null,null,null,null,null,null,null,null,null,null,null,"2017-10-01","2018-10-01","2019-04-01",null,"omr1","omr2","omr3","omr4","omr5",null,null,null,"2017-10-01",2,null,"omr1","omr2","omr3","omr4","omr1","omr2","omr3","omr4",null,null,null,null,"2015-01-01",0,0]
[1,{"$f":"AQ5/12","v":17869.666666666668},18121.666666666668,18296.166666666668,18548.333333333332,18722.75,null,{"$f":"ROUND(AQ5+(AR5-AQ5)/3*faktor,0)/12","v":469117.66666666669},{"$f":"ROUND(AR5+(AS5-AR5)/3*faktor,0)/12","v":330593},{"$f":"ROUND(AS5+(AT5-AS5)/3*faktor,0)/12","v":469842.58333333331},null,1,{"$f":"B5","v":17869.666666666668},{"$f":"C5","v":18121.666666666668},{"$f":"D5","v":18296.166666666668},{"$f":"E5","v":18548.333333333332},{"$f":"F5","v":18722.75},null,{"$f":"(BK5+ROUND((BL5-BK5)/3*faktor,0))/12","v":451248},{"$f":"(BL5+ROUND((BM5-BL5)/3*faktor,0))/12","v":312723.33333333331},{"$f":"(BM5+ROUND((BN5-BM5)/3*faktor,0))/12","v":451972.91666666669},{"$f":"(BN5+ROUND((BO5-BN5)/3*faktor,0))/12","v":313000.75},null,1,197844,{"$f":"ROUND(Y5*regulering,0)","v":16592},{"$f":"Y5+Z5","v":214436},2790,4722,7514,9445,null,2076,3513,5590,7027,null,{"$f":"ROUND(AB5*(1+$AL$4),0)","v":3024},{"$f":"ROUND(AC5*(1+$AL$4),0)","v":5118},8144,10237,1,{"$f":"$AA5","v":214436},{"$f":"$AA5+AL5","v":217460},{"$f":"$AA5+AM5","v":219554},222580,224673,1,{"$f":"AQ5","v":214436},{"$f":"AR5","v":217460},{"$f":"AS5","v":219554},{"$f":"AT5","v":222580},{"$f":"AU5","v":224673},null,null,null,null,{"$f":"ROUND(AL5*udbygningspct,0)","v":3024},{"$f":"ROUND(AM5*udbygningspct,0)","v":5118},{"$f":"ROUND(AN5*udbygningspct,0)","v":8144},{"$f":"ROUND(AO5*udbygningspct,0)","v":10237},null,{"$f":"BD5","v":0},{"$f":"$BK5+BF5","v":3024},{"$f":"$BK5+BG5","v":5118},{"$f":"$BK5+BH5","v":8144},{"$f":"$BK5+BI5","v":10237},null,1,{"$f":"AQ5/1924","v":111.45322245322245},{"$f":"AR5/1924","v":113.02494802494803},{"$f":"AS5/1924","v":114.11330561330561},{"$f":"AT5/1924","v":115.68607068607069},{"$f":"AU5/1924","v":116.77390852390852},null,1,{"$f":"AQ5/1924*1.5","v":167.17983367983368},{"$f":"AR5/1924*1.5","v":169.53742203742206},{"$f":"AS5/1924*1.5","v":171.16995841995842},{"$f":"AT5/1924*1.5","v":173.52910602910603},{"$f":"AU5/1924*1.5","v":175.16086278586278},null,1,{"$f":"AQ5/1924/2","v":55.726611226611226},{"$f":"AR5/1924/2","v":56.512474012474016},{"$f":"AS5/1924/2","v":57.056652806652806},{"$f":"AT5/1924/2","v":57.843035343035346},{"$f":"AU5/1924/2","v":58.386954261954259},null,1,147194,197844,197844,4004,201848,2585,4374,6959,8748,null,null,null,"2018-10-01",3,1,2076,3513,5590,7027,{"$f":"ROUND(DB5*$DB$2,0)","v":2790},{"$f":"ROUND(DC5*$DB$2,0)","v":4722},{"$f":"ROUND(DD5*$DB$2,0)","v":7514},{"$f":"ROUND(DE5*$DB$2,0)","v":9445},null,147194,{"$f":"ROUND(DK5*$DB$2,0)","v":197844},null,"2019-04-01",719,0]
[2,18144.166666666668,18402.416666666668,18581.083333333332,18839.25,19018,null,480583.83333333331,338334.83333333331,480871.5,null,2,{"$f":"B6","v":18144.166666666668},18402.416666666668,18581.083333333332,18839.25,19018,null,462439.66666666669,320190.66666666669,462727.33333333331,320776.75,null,2,200883,{"$f":"ROUND(Y6*regulering,0)","v":16847},217730,2859,4837,7696,9675,null,2127,3599,5726,7198,null,{"$f":"ROUND(AB6*(1+$AL$4),0)","v":3099},{"$f":"ROUND(AC6*(1+$AL$4),0)","v":5243},{"$f":"ROUND(AD6*(1+$AL$4),0)","v":8341},{"$f":"ROUND(AE6*(1+$AL$4),0)","v":10486},2,{"$f":"$AA6","v":217730},{"$f":"$AA6+AL6","v":220829},222973,226071,228216,2,{"$f":"AQ6","v":217730},220829,222973,226071,228216,null,null,null,null,3099,5243,8341,10486,null,0,3099,5243,8341,10486,null,2,113.16528066528066,114.77598752598753,115.89033264033264,117.50051975051976,118.61538461538461,null,2,169.747920997921,172.16398128898129,173.83549896049897,176.25077962577964,177.92307692307691,null,2,56.582640332640331,57.387993762993766,57.945166320166322,58.750259875259879,59.307692307692307,null,2,149455,200883,200883,4065,204948,2648,4481,7128,8961,null,null,null,"2019-04-01",4,2,2127,3599,5726,7198,{"$f":"ROUND(DB6*$DB$2,0)","v":2859},4837,7696,9675,null,149455,{"$f":"ROUND(DK6*$DB$2,0)","v":200883},null,"2022-04-01",{"$f":"DO5+DP6","v":1339},620]
[3,18426.083333333332,18690.416666666668,18873.75,19138.083333333332,19321.25,null,491759,346979.33333333331,492206.66666666669,null,3,18426.083333333332,18690.416666666668,18873.75,19138.083333333332,19321.25,null,473332.91666666669,328553.25,473780.58333333331,328702.41666666669,null,3,204004,17109,221113,2927,4956,7883,9911,null,2178,3687,5865,7374,null,3172,5372,8544,10742,3,221113,224285,226485,229657,231855,3,221113,224285,226485,229657,231855,null,null,null,null,3172,5372,8544,10742,null,0,3172,5372,8544,10742,null,3,114.92359667359668,116.57224532224532,117.71569646569647,119.36434511434511,120.50675675675676,null,3,172.38539501039503,174.858367983368,176.57354469854471,179.04651767151768,180.76013513513513,null,3,57.461798336798338,58.286122661122661,58.857848232848234,59.682172557172557,60.253378378378379,null,3,151777,204004,204004,4129,208133,2711,4590,7301,9180,null,null,null,null,null,3,2178,3687,5865,7374,2927,4956,7883,9911,null,151777,204004]
[4,18715.75,18986.75,19174.416666666668,19445.333333333332,19633,null,503986.41666666669,355035.16666666669,504295.83333333331,null,4,18715.75,18986.75,19174.416666666668,19445.333333333332,19633,null,485270.66666666669,336319.41666666669,485580.08333333331,336778,null,4,207211,17378,224589,3000,5078,8078,10155,null,2232,3778,6010,7555,null,3252,5504,8755,11007,4,224589,227841,230093,233344,235596,4,224589,227841,230093,233344,235596,null,null,null,null,3252,5504,8755,11007,null,0,3252,5504,8755,11007,null,4,116.73024948024948,118.42047817047818,119.59095634095634,121.28066528066527,122.45114345114345,null,4,175.09537422037423,177.63071725571726,179.38643451143452,181.92099792099791,183.67671517671516,null,4,58.365124740124742,59.210239085239088,59.795478170478169,60.640332640332637,61.225571725571726,null,4,154163,207211,207211,4194,211405,2779,4703,7482,9405,null,null,null,null,null,4,2232,3778,6010,7555,3000,5078,8078,10155,null,154163,207211]
[5,19013.333333333332,19291,19483.25,19760.916666666668,19952.916666666668,null,516221.75,363546.66666666669,516691.66666666669,null,5,19013.333333333332,19291,19483.25,19760.916666666668,19952.916666666668,null,497208.41666666669,344533.33333333331,497678.33333333331,344555.58333333331,null,5,210506,17654,228160,3074,5203,8277,10403,null,2287,3871,6158,7740,null,3332,5639,8971,11275,5,228160,231492,233799,237131,239435,5,228160,231492,233799,237131,239435,null,null,null,null,3332,5639,8971,11275,null,0,3332,5639,8971,11275,null,5,118.58627858627858,120.31808731808732,121.51715176715177,123.2489604989605,124.44646569646569,null,5,177.87941787941787,180.47713097713097,182.27572765072767,184.87344074844074,186.66969854469855,null,5,59.293139293139291,60.159043659043661,60.758575883575887,61.62448024948025,62.223232848232847,null,5,156614,210506,210506,4260,214766,2847,4819,7666,9636,null,null,null,null,null,5,2287,3871,6158,7740,3074,5203,8277,10403,null,156614,210506]
[6,19319.333333333332,19603.75,19800.833333333332,20085.25,20282.166666666668,null,528614.75,372514.33333333331,529096.25,null,6,19319.333333333332,19603.75,19800.833333333332,20085.25,20282.166666666668,null,509295.41666666669,353195,509776.91666666669,353378,null,6,213894,17938,231832,3149,5331,8480,10660,null,2343,3966,6309,7931,null,3413,5778,9191,11554,6,231832,235245,237610,241023,243386,6,231832,235245,237610,241023,243386,null,null,null,null,3413,5778,9191,11554,null,0,3413,5778,9191,11554,null,6,120.4948024948025,122.26871101871102,123.497920997921,125.27182952182952,126.5,null,6,180.74220374220374,183.40306652806652,185.24688149688149,187.90774428274426,189.75,null,6,60.24740124740125,61.134355509355508,61.7489604989605,62.635914760914758,63.25,null,6,159135,213894,213894,4329,218223,2917,4937,7854,9873,null,null,null,null,null,6,2343,3966,6309,7931,3149,5331,8480,10660,null,159135,213894]
[7,19633.333333333332,19924.833333333332,20126.833333333332,20418.25,20620,null,541612.66666666663,381639.5,541956.91666666663,null,7,19633.333333333332,19924.833333333332,20126.833333333332,20418.25,20620,null,521979.33333333331,362006.16666666669,522323.58333333331,362051.91666666669,null,7,217370,18230,235600,3227,5464,8690,10924,null,2401,4065,6465,8127,null,3498,5922,9419,11840,7,235600,{"$f":"$AA11+AL11","v":239098},241522,245019,247440,7,235600,239098,241522,245019,247440,null,null,null,null,3498,5922,9419,11840,null,0,3498,5922,9419,11840,null,7,122.45322245322245,124.27130977130977,125.53118503118503,127.3487525987526,128.60706860706861,null,7,183.67983367983368,186.40696465696465,188.29677754677755,191.0231288981289,192.9106029106029,null,7,61.226611226611226,62.135654885654887,62.765592515592516,63.674376299376299,64.303534303534306,null,7,161721,217370,217370,4399,221769,2989,5060,8049,10118,null,null,null,null,null,7,2401,4065,6465,8127,3227,5464,8690,10924,null,161721,217370]
[8,19967.916666666668,20267.083333333332,20474.083333333332,20773.083333333332,20980.083333333332,null,555675.66666666663,390935.08333333331,555883.41666666663,null,8,19967.916666666668,20267.083333333332,20474.083333333332,20773.083333333332,20980.083333333332,null,535707.75,370967.16666666669,535915.5,371473.16666666669,null,8,221074,18541,239615,3312,5604,8914,11206,null,2464,4169,6632,8337,null,3590,6074,9662,12146,8,239615,243205,245689,249277,251761,8,239615,243205,245689,249277,251761,null,null,null,null,3590,6074,9662,12146,null,0,3590,6074,9662,12146,null,8,124.54002079002079,126.40592515592516,127.69698544698545,129.56185031185032,130.85291060291061,null,8,186.81003118503119,189.60888773388774,191.54547817047819,194.34277546777548,196.27936590436593,null,8,62.270010395010395,63.20296257796258,63.848492723492726,64.780925155925161,65.426455301455306,null,8,164477,221074,221074,4474,225548,3067,5190,8256,10379,null,null,null,null,null,8,2464,4169,6632,8337,3312,5604,8914,11206,null,164477,221074]
[9,20596.083333333332,20902.666666666668,21114.833333333332,21421.166666666668,21633.333333333332,null,{"$f":"ROUND(AQ13+(AR13-AQ13)/3*faktor,0)/12","v":569584.66666666663},{"$f":"ROUND(AR13+(AS13-AR13)/3*faktor,0)/12","v":400822.41666666669},{"$f":"ROUND(AS13+(AT13-AS13)/3*faktor,0)/12","v":569655.75},null,9,20596.083333333332,20902.666666666668,21114.833333333332,21421.166666666668,21633.333333333332,null,{"$f":"(BK13+ROUND((BL13-BK13)/3*faktor,0))/12","v":548988.58333333337},{"$f":"(BL13+ROUND((BM13-BL13)/3*faktor,0))/12","v":380226.33333333331},{"$f":"(BM13+ROUND((BN13-BM13)/3*faktor,0))/12","v":549059.66666666663},{"$f":"(BN13+ROUND((BO13-BN13)/3*faktor,0))/12","v":380744.83333333331},null,9,228029,19124,247153,3394,5743,9135,11484,null,2525,4273,6796,8544,null,3679,6225,9901,12447,9,247153,250832,253378,257054,259600,9,247153,250832,253378,257054,259600,null,null,null,null,3679,6225,9901,12447,null,0,3679,6225,9901,12447,null,9,128.4579002079002,130.37006237006236,131.69334719334719,133.6039501039501,134.92723492723493,null,9,192.68685031185029,195.55509355509355,197.54002079002078,200.40592515592516,202.39085239085239,null,9,64.228950103950098,65.185031185031178,65.846673596673597,66.801975051975049,67.463617463617467,null,9,169651,228029,228029,4615,232644,3143,5319,8461,10637,null,null,null,null,null,9,2525,4273,6796,8544,3394,5743,9135,11484,null,169651,228029]
[10,20741.5,21055.583333333332,21273.166666666668,21587.166666666668,21804.75,null,583160.08333333337,410674.83333333331,583542.5,null,10,20741.5,21055.583333333332,21273.166666666668,21587.166666666668,21804.75,null,562418.58333333337,389933.33333333331,562801,390464.91666666669,null,10,229639,19259,248898,3477,5886,9363,11772,null,2587,4379,6966,8758,null,3769,6380,10148,12759,10,248898,252667,255278,259046,261657,10,248898,252667,255278,259046,261657,null,null,null,null,3769,6380,10148,12759,null,0,3769,6380,10148,12759,null,10,129.36486486486487,131.32380457380458,132.68087318087319,134.63929313929313,135.99636174636174,null,10,194.04729729729729,196.98570686070687,199.0213097713098,201.95893970893968,203.99454261954261,null,10,64.682432432432435,65.66190228690229,66.340436590436596,67.319646569646565,67.998180873180871,null,10,170849,229639,229639,4647,234286,3221,5451,8672,10903,null,null,null,null,null,10,2587,4379,6966,8758,3477,5886,9363,11772,null,170849,229639]
[11,21131.666666666668,21453.666666666668,21676.666666666668,21998.5,22221.5,null,597726.33333333337,420772.33333333331,597972.91666666663,null,11,21131.666666666668,21453.666666666668,21676.666666666668,21998.5,22221.5,null,576594.66666666663,399640.66666666669,576841.25,400185.5,null,11,232620,{"$f":"ROUND(IF(beregningsdato>=$AA$4,SUM(Y15,$Y$4)*regulering,Y15*regulering),0)","v":19621},{"$f":"IF(beregningsdato>=$AA$4,SUM($Y$4,Y15:Z15),SUM(Y15:Z15))","v":253580},3565,6034,9597,12066,null,2652,4489,7140,8977,null,3864,6540,10402,13078,11,{"$f":"$AA15","v":253580},257444,260120,263982,266658,11,253580,257444,260120,263982,266658,null,null,null,null,3864,6540,10402,13078,null,0,3864,6540,10402,13078,null,11,131.79833679833681,133.80665280665281,135.19750519750519,137.20478170478171,138.5956340956341,null,11,197.69750519750522,200.70997920997922,202.79625779625781,205.80717255717258,207.89345114345116,null,11,65.899168399168403,66.903326403326403,67.598752598752597,68.602390852390855,69.297817047817048,null,11,173067,232620,233339,4722,237342,3301,5588,8889,11175,null,null,null,null,null,11,2652,4489,7140,8977,3565,6034,9597,12066,null,173067,232620]
{"$rows_left_out":56}
{"sheet":"Forside","index":3,"n_rows":11,"n_cols":11,"rows_kept":11,"cut":false,"hidden":false,"merged":[[14,3,14,7]]}
[]
[]
[]
[]
[]
[]
[]
[]
[]
[]
[null,null,null,null,null,null,null,null,null,"Lønniveau:","2022-10-01"]

{"sheet":"Omregningstabel ","index":4,"n_rows":25,"n_cols":16,"rows_kept":25,"cut":false,"hidden":true,"merged":[]}
[null,null,null,1.362716,1.3824959999999999,1.3980790000000001,1.018559,1.040662,1.0511569999999999,1.061566,1.0834220000000001,1.0886800000000001,1.0926750000000001,1.109523,1.1200380000000001,1.1244540000000001]
[]
[]
[]
[]
[]
[null,"Indtast beløb:",1000]
[]
[]
[null,null,"1/10 '84"]
[null,null,{"$f":"Beløb","v":1000},"1/4 '98"]
[null,"1/4-98",{"$f":"Beløb*_1_4_1998","v":1362.7160000000001},{"$f":"Beløb","v":1000},"1/10 '98"]
[null,"1/10-98",{"$f":"Beløb*_1_10_1998","v":1382.4959999999999},{"$f":"Beløb/_1_4_1998*_1_10_1998","v":1014.515130078461},{"$f":"Beløb","v":1000},"1/4 '99"]
[null,"1/4-99",{"$f":"Beløb*_1_4_1999","v":1398.0790000000002},{"$f":"Beløb/_1_4_1998*_1_4_1999","v":1025.9503814441161},{"$f":"Beløb/_1_10_1998*_1_4_1999","v":1011.2716420156008},{"$f":"Beløb","v":1000}]
[null,"Grundbeløb pr. 31/3-00",{"$f":"ROUND(C14,-2)","v":1400},{"$f":"ROUND(D14,-2)","v":1000},{"$f":"ROUND(E14,-2)","v":1000},{"$f":"ROUND(F14,-2)","v":1000},"1/4 '00"]
{"$rows_left_out":11}
{"sheet":"Tillæg_trin","index":5,"n_rows":16,"n_cols":4,"rows_kept":16,"cut":false,"hidden":true,"merged":[[1,1,1,7]]}
[3]
[]
[null,"Valgt lønniveau: ",{"$f":"Forside!K11","v":"2022-10-01"}]
[]
[null,"Løngruppe",null,3]
[null,"Timer/uge",null,37]
[null,"Pensions-% inkl. evt. fritvalgs-%",null,13.89]
[null,"Særlig feriegodtgørelse, aktuel pct.",null,1.95]
[]
[null,"Stigning:","Fra","Til"]
[null,"Løntrin ",18,19]
[]
[null,"Løn",{"$f":"(VLOOKUP(til_trin,Lønark!A4:F60,løngruppe+2,FALSE)-VLOOKUP(fra_trin,Lønark!A4:F60,løngruppe+2,FALSE))/37*timetal*12","v":4144.0000000000291}]
[null,"Pension inkl. evt. fritvalgstillæg",{"$f":"(VLOOKUP(til_trin,Lønark!L4:Q60,løngruppe+2,FALSE)-VLOOKUP(fra_trin,Lønark!L4:Q60,løngruppe+2,FALSE))/37*timetal*pensionsstatus%*12","v":575.60160000000405}]
[null,"Ferietillæg",{"$f":"ferie_pct%*C13","v":80.808000000000561}]
{"$rows_left_out":2}
{"sheet":"Tillæg_kr","index":6,"n_rows":15,"n_cols":4,"rows_kept":15,"cut":false,"hidden":true,"merged":[[9,1,9,2]]}
[2]
[]
[null,null,"Valgt lønniveau:",{"$f":"Forside!K11","v":"2022-10-01"}]
[]
[{"$f":"VLOOKUP(dummy,reg_procenter,2,FALSE)","v":{"$error":"#NAME?"}},null,"Årligt beløb, 31.3.2000 niveau ",12900]
[null,null,"Timer/uge",30]
[null,null,"Pension-% inkl. evt. fritvalgs-%",13.89]
[null,null,"Særlig feriegodtg., aktuel pct.",1.95]
[]
[]
[null,null,"bruttoudgift / år","bruttoudgift / md"]
[null,"Løn",{"$f":"kr*valgt_regulering/37*timetal","v":11336.652486486488},{"$f":"beløb/12","v":944.72104054054068}]
[null,"Pension inkl. evt. fritvalgstillæg",{"$f":"beløb*pensionsstatus%","v":1574.6610303729731},{"$f":"C13/12","v":131.22175253108108}]
[null,"Ferietillæg",{"$f":"D8%*(C12)","v":221.06472348648651},{"$f":"C14/12","v":18.422060290540543}]
[null,"Bruttoudgift i alt",{"$f":"ROUND(SUM(C12:C14),0)","v":13132},{"$f":"ROUND(SUM(D12:D14),0)","v":1094}]
{"$rows_left_out":1}
{"sheet":"Omregner_gl. til nyt_niveau","index":7,"n_rows":14,"n_cols":12,"rows_kept":14,"cut":false,"hidden":false,"merged":[[1,1,1,5],[1,9,1,13]]}
[]
[null,"Omregner A\n- fra grundbeløb 31.3.2000 niveau til nyt grundbeløb pr. 31.3.2018 - RLTN",null,null,null,null,null,null,null,"Omregner B\n- fra nutidskroner tilbage til nyt grundbeløb pr. 31.3.2018 - RLTN"]
[]
[null,"Brug omregneren, når satser og tillæg i lokale aftaler skal omlægges til ny niveau på regionsområdet",null,null,null,null,null,null,null,"Brug omregneren, når du vil finde ud af hvad et givent beløb i nutidskroner svarer til i nyt grundbeløb "]
[]
[]
[]
[null,"Kun ÅRLIGE grundbeløb;\nIndtast årligt grundbeløb pr. 31.3.2000",null,"Nyt grundbeløb \npr. 31.3.2018",null,{"$f":"\"Aktuelt beløb \npr. \"&DAY(beregningsdato)&\".\"&MONTH(beregningsdato)&\".\"&YEAR(beregningsdato)","v":"Aktuelt beløb \npr. 1.10.2022"},null,null,null,{"$f":"\"Tillæg pr. år;\nIndtast beløb i nutidskroner (\"&DAY(beregningsdato)&\".\"&MONTH(beregningsdato)&\".\"&YEAR(beregningsdato)&\")\"","v":"Tillæg pr. år;\nIndtast beløb i nutidskroner (1.10.2022)"},null,"svarer til:\nårligt grundbeløb (31/3-2018)"]
[null,1500,"=>",{"$f":"ROUND(B9*1.344105,0)","v":2016},"=>",{"$f":"ROUND(D9*valgt_regulering,2)","v":2185.0700000000002},null,null,null,31000,"=>",{"$f":"ROUND(J9/1.020238,0)","v":30385}]
[]
[]
[]
[null,"Grundbeløb pr. måned/uge eller pr. tidsenhed\nIndtast grundbeløb pr. 31.3.2000",null,"Nyt grundbeløb \npr. 31.3.2018",null,{"$f":"\"Aktuelt beløb \npr. \"&DAY(beregningsdato)&\".\"&MONTH(beregningsdato)&\".\"&YEAR(beregningsdato)","v":"Aktuelt beløb \npr. 1.10.2022"},null,null,null,{"$f":"\"Tillæg pr. måned/uge eller pr. tidsenhed;\nIndtast beløb i nutidskroner (\"&DAY(beregningsdato)&\".\"&MONTH(beregningsdato)&\".\"&YEAR(beregningsdato)&\")\"","v":"Tillæg pr. måned/uge eller pr. tidsenhed;\nIndtast beløb i nutidskroner (1.10.2022)"},null,"svarer til:\n grundbeløb \n(31/3-2018)"]
[null,34.85,"=>",{"$f":"ROUND(B14*1.344105,2)","v":46.84},"=>",{"$f":"ROUND(D14*valgt_regulering,2)","v":50.77},null,null,null,47.8,"=>",{"$f":"J14/valgt_regulering","v":44.10139260757326}]

{"sheet":"Tid op_ned","index":8,"n_rows":31,"n_cols":8,"rows_kept":31,"cut":false,"hidden":false,"merged":[]}
[2,"Valgt lønniveau: ",{"$f":"Forside!K11","v":"2022-10-01"}]
[]
[null,"Grundoplysninger:"]
[null,"Løngruppe",0]
[null,"Pensions-% inkl. evt. fritvalgs-%",14.7]
[null,"Særlig feriegodtgørelse, aktuel procent",1.95]
[]
[]
[null,"Lønsammensætning (trin i alt og grundbeløb i alt)","Før ændring",null,"Efter ændring"]
[]
[null,"Løndele:","I alt"]
[]
[null,"Løntrin - centralt og lokalt aftalte",22,null,22]
[]
["2018-10-01",{"$f":"IF(C1<A15,\"Tillæg (grundbeløb 31.3.2000) kr./år centralt og lokalt aftalte\",\"Tillæg (grundbeløb 31.3.2018) kr./år centralt og lokalt aftalte\")","v":"Tillæg (grundbeløb 31.3.2018) kr./år centralt og lokalt aftalte"},9192]
{"$rows_left_out":17}
{"sheet":"Samlet_omk","index":9,"n_rows":23,"n_cols":3,"rows_kept":23,"cut":false,"hidden":false,"merged":[]}
[2,"Valgt lønniveau: ",{"$f":"Forside!K11","v":"2022-10-01"}]
[]
[null,"Løngruppe",0]
[null,"Timer/uge",37]
[null,"Pensions-% inkl. evt. fritvalgs-%",13.89]
[null,"Særlig feriegodtgørelse, aktuel pct.",1.95]
[]
[null,"Løntrin ",22]
[]
["2018-10-01",{"$f":"IF(C1<A10,\"Reguleret tillæg (niveau 31.3.2000) kr./år\",\"Reguleret tillæg (niveau 31.3.2018) kr./år\")","v":"Reguleret tillæg (niveau 31.3.2018) kr./år"}]
[]
[]
[null,"Løn/måned",{"$f":"(VLOOKUP(fra_trin,Lønkort_løn,løngruppe+2,FALSE)+(C10*valgt_regulering))/12/37*timetal","v":25108.833333333332}]
[null,"Pension inkl. evt. fritvalgstillæg",{"$f":"(VLOOKUP(fra_trin,Lønkort_pens,løngruppe+2,FALSE)+(C10*valgt_regulering))/12/37*timetal*pensionsstatus%","v":3487.6169499999996}]
[null,"Ferietillæg",{"$f":"C6%*C13","v":489.62224999999995}]
{"$rows_left_out":9}
{"sheet":"Omregner_00_niveau","index":10,"n_rows":24,"n_cols":12,"rows_kept":24,"cut":false,"hidden":false,"merged":[]}
[null,null,null,null,null,null,null,null,null,null,null,"2018-10-01"]
[null,null,null,null,null,null,null,null,null,null,null,{"$f":"IF(F11<L1,\"00\",\"18\")","v":"18"}]
[]
[]
[]
[]
[]
[]
[]
[]
[null,null,null,"Valgt lønniveau:",null,{"$f":"Forside!K11","v":"2022-10-01"},null,"Timetal:",37]
[]
[null,{"$f":"\"1) Grundbeløb pr. 31-3-20\"&L2&\" omregnet til nutidskr.\"","v":"1) Grundbeløb pr. 31-3-2018 omregnet til nutidskr."}]
[null,null,"Årligt grundbeløb:",null,30377]
[]
{"$rows_left_out":9}